GNOME Bugzilla – Bug 134067
Unable to build gok-0.9.6.
Last modified: 2004-12-22 21:47:04 UTC
I get the following error when trying to build gok-0.9.6 on garnome-0.29.1 which includes all recent updates to latest gnome packages. /bin/sh ../libtool --mode=link cc -g -I/home/rodd/testing-2.5.2/include -I/usr/ X11R6/include -L/home/rodd/testing-2.5.2/lib -L/usr/X11R6/lib -O2 -pipe -L/home/ rodd/testing-2.5.2/lib -L/usr/X11R6/lib -o test-focus-reject test-focus-reject. o -pthread -Wl,--export-dynamic -L/home/rodd/testing-2.5.2/lib -L/usr/X11R6/lib -lgnomeui-2 -lSM -lICE -lbonoboui-2 -lxml2 -lpthread -lz -lgnome-2 -lpopt -lgcon f-2 -lgnomevfs-2 -lcspi -lspi -lbonobo-2 -lbonobo-activation -lORBit-2 -lgthread -2.0 -lgailutil -lgnomecanvas-2 -lart_lgpl_2 -lpangoft2-1.0 -lwnck-1 -lgtk-x11-2 .0 -lstartup-notification-1 -lgdk-x11-2.0 -latk-1.0 -lgdk_pixbuf-2.0 -lXcursor - lpangoxft-1.0 -lpangox-1.0 -lpango-1.0 -lgobject-2.0 -lgmodule-2.0 -ldl -lglib-2 .0 -lesd -laudiofile -lm -L/usr/X11R6/lib -lSM -lICE -lX11 -lXi - version-info 0:6:0 libtool: link: warning: `-version-info' is ignored for programs cc -g -I/home/rodd/testing-2.5.2/include -I/usr/X11R6/include -O2 -pipe -o test- focus-reject test-focus-reject.o -pthread -Wl,--export-dynamic -L/home/rodd/tes ting-2.5.2/lib -L/usr/X11R6/lib /home/rodd/testing-2.5.2/lib/libgnomeui-2.so -L/ usr/kerberos/lib /home/rodd/testing-2.5.2/lib/libgnome-keyring.so /usr/lib/libjp eg.so /home/rodd/testing-2.5.2/lib/libbonoboui-2.so /home/rodd/testing-2.5.2/lib /libgnome-2.so /home/rodd/testing-2.5.2/lib/libgnomevfs-2.so /home/rodd/testing- 2.5.2/lib/libgconf-2.so /home/rodd/testing-2.5.2/lib/libxml2.so -lssl -lcrypto - lgssapi_krb5 -lkrb5 -lcom_err -lk5crypto -lresolv -lz -lrt /home/rodd/testing-2. 5.2/lib/libcspi.so /home/rodd/testing-2.5.2/lib/libspi.so -lXtst /home/rodd/test ing-2.5.2/lib/libbonobo-2.so /home/rodd/testing-2.5.2/lib/libbonobo-activation.s o /home/rodd/testing-2.5.2/lib/libORBitCosNaming-2.so /home/rodd/testing-2.5.2/l ib/libORBit-2.so /usr/lib/libpopt.so /home/rodd/testing-2.5.2/lib/libgthread-2.0 .so -lpthread /home/rodd/testing-2.5.2/lib/libgailutil.so /home/rodd/testing-2.5 .2/lib/libgnomecanvas-2.so /home/rodd/testing-2.5.2/lib/libart_lgpl_2.so /home/r odd/testing-2.5.2/lib/libpangoft2-1.0.so /home/rodd/testing-2.5.2/lib/libwnck-1. so -lXRes -lXext /home/rodd/testing-2.5.2/lib/libgtk-x11-2.0.so -lstartup-notifi cation-1 /home/rodd/testing-2.5.2/lib/libgdk-x11-2.0.so /home/rodd/testing-2.5.2 /lib/libatk-1.0.so /home/rodd/testing-2.5.2/lib/libgdk_pixbuf-2.0.so -lXcursor / home/rodd/testing-2.5.2/lib/libpangoxft-1.0.so /home/rodd/testing-2.5.2/lib/libp angox-1.0.so /home/rodd/testing-2.5.2/lib/libpango-1.0.so /home/rodd/testing-2.5 .2/lib/libgobject-2.0.so /home/rodd/testing-2.5.2/lib/libgmodule-2.0.so -ldl /ho me/rodd/testing-2.5.2/lib/libglib-2.0.so -lesd -laudiofile -lm -lSM -lICE -lX11 -lXi -Wl,--rpath -Wl,/home/rodd/testing-2.5.2/lib -Wl,--rpath -Wl,/home/rodd/tes ting-2.5.2/lib make[3]: *** No rule to make target `GNOME_Gok.server.in.in', needed by `GNOME_G ok.server.in'. Stop. make[3]: Leaving directory `/home/rodd/garnome-0.29.1/desktop/gok/work/main.d/go k-0.9.6/gok' make[2]: *** [all-recursive] Error 1 make[2]: Leaving directory `/home/rodd/garnome-0.29.1/desktop/gok/work/main.d/go k-0.9.6' make[1]: *** [all-recursive-am] Error 2 make[1]: Leaving directory `/home/rodd/garnome-0.29.1/desktop/gok/work/main.d/go k-0.9.6' make: *** [build-work/main.d/gok-0.9.6/Makefile] Error 2 [rodd@flathead gok]$
*** This bug has been marked as a duplicate of 134036 ***