GNOME Bugzilla – Bug 128697
generate_extra_defs.h not present, breaks build.
Last modified: 2004-12-22 21:47:04 UTC
generate_defs_gnome_vfs.cc:22:59: gtkmm_generate_extra_defs/generate_extra_defs.h: No such file or directory generate_defs_gnome_vfs.cc: In function `int main(int, char**)': generate_defs_gnome_vfs.cc:32: error: `cout' undeclared in namespace `std' generate_defs_gnome_vfs.cc:32: error: `get_defs' undeclared (first use this function) generate_defs_gnome_vfs.cc:32: error: (Each undeclared identifier is reported only once for each function it appears in.) make[2]: *** [generate_defs_gnome_vfs.o] Error 1 make[2]: Leaving directory `/home/billyoc/cvs/gnome2/gnomemm/gnome-vfsmm/tools/extra_defs_gen'
I am getting deja-vu here. What tarball or cvs module is this exactly?
Murray, I'm sorry, this and the other bug like it were due to a bad toolchain. Five or six other packages failed to build from anoncvs using jhbuild's gnome26 moduleset. I'm marking them invalid.