GNOME Bugzilla – Bug 110948
Fails to build
Last modified: 2004-12-22 21:47:04 UTC
Version 2.3.0 fails to build on my system (this is the version in Garnome 0.23.1). The version 2.2.1 built alright. Error during compile: make[3]: Entering directory `/home/builder/garnome-0.23.1/gnome/eog/work/main.d/eog-2.3.0/collection' cc -DHAVE_CONFIG_H -I. -I. -I.. -DGNOMELOCALEDIR=\""/usr/local/gnome23/share/locale"\" -DG_LOG_DOMAIN=\"Eog\" -DDATADIR=\""/usr/local/gnome23/share"\" -I.. -I.. -I../libeog -I../libeog -pthread -DORBIT2=1 -I/usr/local/gnome23/include/gtk-2.0 -I/usr/local/gnome23/include/glib-2.0 -I/usr/local/gnome23/lib/glib-2.0/include -I/usr/local/gnome23/include/gnome-vfs-2.0 -I/usr/local/gnome23/lib/gnome-vfs-2.0/include -I/usr/local/gnome23/include/bonobo-activation-2.0 -I/usr/local/gnome23/include/orbit-2.0 -I/usr/local/gnome23/include/linc-1.0 -I/usr/local/gnome23/include/libgnomeui-2.0 -I/usr/local/gnome23/include/libgnome-2.0 -I/usr/local/gnome23/include/libgnomecanvas-2.0 -I/usr/local/gnome23/include/libart-2.0 -I/usr/local/gnome23/include/gconf/2 -I/usr/local/gnome23/include/libbonoboui-2.0 -I/usr/local/gnome23/include/libbonobo-2.0 -I/usr/local/gnome23/include/pango-1.0 -I/usr/local/gnome23/include -I/usr/local/gnome23/include/freetype2 -I/usr/local/gnome23/lib/gtk-2.0/include -I/usr/local/gnome23/include/atk-1.0 -I/usr/X11R6/include -I/usr/local/gnome23/include/libxml2 -I/usr/local/gnome23/include/libglade-2.0 -I/usr/local/gnome23/include/eel-2 -I/usr/local/gnome23/include/gail-1.0 -Wall -Wunused -Wmissing-prototypes -Wmissing-declarations -I/usr/local/gnome23/include -I/usr/X11R6/include -I/usr/local/gnome23/include -I/usr/X11R6/include -I/usr/local/gnome23/include -I/usr/X11R6/include -L/usr/local/gnome23/lib -L/usr/X11R6/lib -O2 -pipe -I/usr/local/gnome23/include -I/usr/X11R6/include -L/usr/local/gnome23/lib -L/usr/X11R6/lib -O2 -pipe -c eog-collection-item.c eog-collection-item.c: In function `eog_collection_item_new': eog-collection-item.c:406: incompatible type for argument 4 of `gnome_canvas_item_construct' make[3]: *** [eog-collection-item.o] Error 1 make[3]: Leaving directory `/home/builder/garnome-0.23.1/gnome/eog/work/main.d/eog-2.3.0/collection' make[2]: *** [all-recursive] Error 1 make[2]: Leaving directory `/home/builder/garnome-0.23.1/gnome/eog/work/main.d/eog-2.3.0' make[1]: *** [all-recursive-am] Error 2 make[1]: Leaving directory `/home/builder/garnome-0.23.1/gnome/eog/work/main.d/eog-2.3.0' make: *** [build-work/main.d/eog-2.3.0/Makefile] Error 2
This issue should be fixed in cvs head now. Please test it out again. Thanks.