GNOME Bugzilla – Bug 664758
Paralell build failure
Last modified: 2019-02-22 11:58:18 UTC
Created attachment 202086 [details] [review] Adjust dependency Building gcr-3.3.2.1 with make -j5 here I am getting the following failure ............. LC_ALL=C /usr/bin/intltool-merge -d -u -c ../po/.intltool-merge-cache ../po gcr-viewer.desktop.in gcr-viewer.desktop cp gcr.pc gcr-3.pc cp gcr-base.pc gcr-base-3.pc CCLD libgcr-base-3.la CCLD libgcr-testable.la libtool: link: cannot find the library `./libgcr-base-3.la' or unhandled argument `./libgcr-base-3.la' make[4]: *** [libgcr-testable.la] Error 1 make[4]: *** Waiting for unfinished jobs.... Generating and caching the translation database Merging translations into gcr-viewer.desktop. make[4]: Leaving directory `/home/yaneti/rpmbuild/BUILD/gcr-3.3.2.1/gcr' make[3]: *** [all-recursive] Error 1 make[3]: Leaving directory `/home/yaneti/rpmbuild/BUILD/gcr-3.3.2.1/gcr' make[2]: *** [all] Error 2 make[2]: Leaving directory `/home/yaneti/rpmbuild/BUILD/gcr-3.3.2.1/gcr' make[1]: *** [all-recursive] Error 1 make[1]: Leaving directory `/home/yaneti/rpmbuild/BUILD/gcr-3.3.2.1' make: *** [all] Error 2 The attachment fixes this for me.
*** This bug has been marked as a duplicate of bug 666375 ***